⚠ Archived content — this site is no longer maintained.   Current WebKit documentation is at docs.webkit.org.

Changeset 127222 in webkit


Ignore:
Timestamp:
Aug 30, 2012, 6:15:12 PM (14 years ago)
Author:
fpizlo@apple.com
Message:

ASSERTION FAILURE in JSC::JSGlobalData::float32ArrayDescriptor when running fast/js/dfg-float64array.html
​https://bugs.webkit.org/show_bug.cgi?id=95398

Reviewed by Mark Hahnenberg.

Source/JavaScriptCore:

Trying to get the build failure to be a bit more informative.

  • runtime/JSGlobalData.h:

(JSGlobalData):

LayoutTests:

Temporarily unskipping tests to figure out what is going.

  • platform/mac-wk2/Skipped:
Location:
trunk
Files:
4 edited

Legend:

Unmodified
Added
Removed
  • trunk/LayoutTests/ChangeLog

    r127218 r127222  
     12012-08-30  Filip Pizlo  <fpizlo@apple.com>
     2
     3        ASSERTION FAILURE in JSC::JSGlobalData::float32ArrayDescriptor when running fast/js/dfg-float64array.html
     4        https://bugs.webkit.org/show_bug.cgi?id=95398
     5
     6        Reviewed by Mark Hahnenberg.
     7
     8        Temporarily unskipping tests to figure out what is going.
     9
     10        * platform/mac-wk2/Skipped:
     11
    1122012-08-30  Roger Fong  <roger_fong@apple.com>
    213
  • trunk/LayoutTests/platform/mac-wk2/Skipped

    r127080 r127222  
    376376sputnik/Unicode/Unicode_218/S7.6_A5.2_T1.html
    377377
    378 # Asserts under JSC::DFG::SpeculativeJIT::typedArrayDescriptor
    379 # https://bugs.webkit.org/show_bug.cgi?id=95398
    380 fast/js/dfg-int32array.html
    381 fast/js/dfg-float32array.html
    382 fast/js/dfg-uint8clampedarray.html
    383 fast/js/dfg-poison-fuzz.html
    384 fast/js/dfg-float64array.html
    385 fast/js/dfg-int32array-overflow-values.html
    386 fast/js/dfg-inline-function-dot-caller.html
    387 
    388378### END OF (3) Unclassified failures
    389379########################################
  • trunk/Source/JavaScriptCore/ChangeLog

    r127214 r127222  
     12012-08-30  Filip Pizlo  <fpizlo@apple.com>
     2
     3        ASSERTION FAILURE in JSC::JSGlobalData::float32ArrayDescriptor when running fast/js/dfg-float64array.html
     4        https://bugs.webkit.org/show_bug.cgi?id=95398
     5
     6        Reviewed by Mark Hahnenberg.
     7
     8        Trying to get the build failure to be a bit more informative.
     9
     10        * runtime/JSGlobalData.h:
     11        (JSGlobalData):
     12
    1132012-08-30  Geoffrey Garen  <ggaren@apple.com>
    214
  • trunk/Source/JavaScriptCore/runtime/JSGlobalData.h

    r127202 r127222  
    421421            ASSERT(!m_##type##ArrayDescriptor.m_classInfo || m_##type##ArrayDescriptor.m_classInfo == descriptor.m_classInfo); \
    422422            m_##type##ArrayDescriptor = descriptor; \
     423            ASSERT(m_##type##ArrayDescriptor.m_classInfo); \
    423424        } \
    424425        const TypedArrayDescriptor& type##ArrayDescriptor() const { ASSERT(m_##type##ArrayDescriptor.m_classInfo); return m_##type##ArrayDescriptor; }
Note: See TracChangeset for help on using the changeset viewer.