Changeset 277489 in webkit
- Timestamp:
- May 14, 2021, 8:51:07 AM (5 years ago)
- Location:
- trunk/Tools
- Files:
-
- 4 edited
-
CISupport/build-webkit-org/steps.py (modified) (1 diff)
-
CISupport/build-webkit-org/steps_unittest.py (modified) (5 diffs)
-
ChangeLog (modified) (1 diff)
-
Scripts/test-lldb-webkit (modified) (1 diff)
Legend:
- Unmodified
- Added
- Removed
-
trunk/Tools/CISupport/build-webkit-org/steps.py
r277444 r277489 738 738 descriptionDone = ["lldb-webkit-tests"] 739 739 command = [ 740 "python ",740 "python3", 741 741 "./Tools/Scripts/test-lldb-webkit", 742 742 "--verbose", -
trunk/Tools/CISupport/build-webkit-org/steps_unittest.py
r277395 r277489 703 703 timeout=1200, 704 704 logEnviron=True, 705 command=['python ', './Tools/Scripts/test-lldb-webkit', '--verbose', '--no-build', '--release'],705 command=['python3', './Tools/Scripts/test-lldb-webkit', '--verbose', '--no-build', '--release'], 706 706 ) + 0, 707 707 ) … … 717 717 timeout=1200, 718 718 logEnviron=True, 719 command=['python ', './Tools/Scripts/test-lldb-webkit', '--verbose', '--no-build', '--release'],719 command=['python3', './Tools/Scripts/test-lldb-webkit', '--verbose', '--no-build', '--release'], 720 720 ) + 2, 721 721 ) … … 731 731 timeout=1200, 732 732 logEnviron=True, 733 command=['python ', './Tools/Scripts/test-lldb-webkit', '--verbose', '--no-build', '--release'],733 command=['python3', './Tools/Scripts/test-lldb-webkit', '--verbose', '--no-build', '--release'], 734 734 ) + 2 735 735 + ExpectShell.log('stdio', stdout='FAILED (failures=2, errors=0)'), … … 746 746 timeout=1200, 747 747 logEnviron=True, 748 command=['python ', './Tools/Scripts/test-lldb-webkit', '--verbose', '--no-build', '--release'],748 command=['python3', './Tools/Scripts/test-lldb-webkit', '--verbose', '--no-build', '--release'], 749 749 ) + 2 750 750 + ExpectShell.log('stdio', stdout='FAILED (failures=0, errors=2)'), … … 761 761 timeout=1200, 762 762 logEnviron=True, 763 command=['python ', './Tools/Scripts/test-lldb-webkit', '--verbose', '--no-build', '--release'],763 command=['python3', './Tools/Scripts/test-lldb-webkit', '--verbose', '--no-build', '--release'], 764 764 ) + 2 765 765 + ExpectShell.log('stdio', stdout='FAILED (failures=30, errors=2)'), -
trunk/Tools/ChangeLog
r277485 r277489 1 2021-05-14 Jonathan Bedard <jbedard@apple.com> 2 3 test-lldb-webkit failing with import of lldb 4 https://bugs.webkit.org/show_bug.cgi?id=225792 5 <rdar://problem/77993980> 6 7 Reviewed by Dewei Zhu. 8 9 * CISupport/build-webkit-org/steps.py: 10 (RunLLDBWebKitTests): Invoke test-lldb-webkit with Python 3. 11 * CISupport/build-webkit-org/steps_unittest.py: 12 * Scripts/test-lldb-webkit: Change shebang to Python 3. 13 1 14 2021-05-14 Carlos Garcia Campos <cgarcia@igalia.com> 2 15 -
trunk/Tools/Scripts/test-lldb-webkit
r275122 r277489 1 #!/usr/bin/env python 1 #!/usr/bin/env python3 2 2 # Copyright (c) 2019 Apple Inc. All rights reserved. 3 3 #
Note:
See TracChangeset
for help on using the changeset viewer.